{"text_format":"1","workbook":"xlsx","n_sheets":7,"sheets":["INSTRUCTIONS","SEMESTER TRACKER","SINGLE COURSE","CUMULATIVE GPA","METRICS","TOOLS","NOTES"],"not_rendered":{"charts":2,"images":15,"macros":1,"external_links":0,"defined_names":5,"comments":2,"pivot_tables":0},"unopened":[],"bounds":{"document_bytes":16777216,"sheet_cells":100000,"rows_first":2000,"rows_last":500,"rows_between":2000,"halvings":0,"cell_chars":16384,"cell_head_chars":4096},"cells_cut":0,"cells_raw":0,"read":"whole","date_system":"1900"}

{"sheet":"INSTRUCTIONS","index":0,"n_rows":293,"n_cols":15,"rows_kept":293,"cut":false,"hidden":false,"merged":[[9,14,11,17],[29,1,31,1],[7,9,7,10],[9,9,9,10],[11,9,11,10],[6,1,12,2],[7,4,7,6],[9,4,9,5],[11,4,11,5]]}
[]
[]
[null,"GRADE CALCULATOR v3.0",null,null,null,null,"Updated January 2014"]
[null,"INSTRUCTIONS"]
[]
[]
[null,"QUICK \nNAVIGATION\n( click link, then \nscroll if necessary )"]
[null,null,null,null,{"$f":"HYPERLINK(\"[GradeCalcV3.xlsm]INSTRUCTIONS!A16\",\"GENERAL INFORMATION\")","v":"GENERAL INFORMATION"},null,null,null,null,{"$f":"HYPERLINK(\"[GradeCalcV3.xlsm]INSTRUCTIONS!A53\",\"SEMESTER TRACKER\")","v":"SEMESTER TRACKER"},null,null,null,"GRADE WORKBOOK OWNER:"]
[]
[null,null,null,null,{"$f":"HYPERLINK(\"[GradeCalcV3.xlsm]INSTRUCTIONS!A207\",\"FAQs\")","v":"FAQs"},null,null,null,null,{"$f":"HYPERLINK(\"[GradeCalcV3.xlsm]INSTRUCTIONS!A107\",\"SINGLE COURSE\")","v":"SINGLE COURSE"},null,null,null,null,"< type name >"]
[]
[null,null,null,null,{"$f":"HYPERLINK(\"[GradeCalcV3.xlsm]INSTRUCTIONS!A270\",\"LEGAL\")","v":"LEGAL"},null,null,null,null,{"$f":"HYPERLINK(\"[GradeCalcV3.xlsm]INSTRUCTIONS!A152\",\"CUMULATIVE GPA\")","v":"CUMULATIVE GPA"}]
[]
[]
[]
[null,"GENERAL INFORMATION"]
[]
[]
[null,"Congratulations on making the decision to use the most efficient and effective grade calculating tool for Ryerson Students."]
[null,"If there are any questions regarding this application, the developer (Aaron Mohammed) can be contacted"]
[null,"at aaron.8903@live.com. "]
[]
[null,"Similarly, if a bug/issue is found, please send a brief report to the address provided (include system details by clicking \"SYSTEM INFORMATION\" button at top)."]
[]
[null,"Enjoy, and best of luck in your studies."]
[]
[null,"NOTE: Be sure macros are enabled - a warning message may be displayed when opening this application."]
[null,null,"This application does not contain any malicious code or virus."]
[]
[null,"TIPS:","● Leave any field you do not need/want blank."]
[null,null,"● The \"Control Panel\" includes tab-specifc buttons; always located at top (where applicable)."]
[null,null,"● Save often to prevent lost data."]
[]
[]
[null,"Various calculators and tools exist on separate tabs, as shown in the below image:"]
[]
[]
[]
[null,null,"Navigate the difference areas of the application by selection of a tab at the bottom."]
[]
{"$rows_left_out":254}
{"sheet":"SEMESTER TRACKER","index":1,"n_rows":53,"n_cols":28,"rows_kept":53,"cut":false,"hidden":false,"merged":[[14,9,14,11],[17,9,17,11],[33,9,35,9],[14,5,14,7],[17,5,17,7],[33,5,35,5],[15,9,15,11],[16,9,16,11],[16,5,16,7],[14,1,14,3],[41,1,44,2],[41,3,42,5],[43,3,44,5],[15,1,15,3],[15,5,15,7],[41,6,42,6],[43,6,44,6],[17,1,17,3],[33,1,35,1],[16,1,16,3],[14,13,14,15],[17,13,17,15],[33,13,35,13],[14,17,14,19],[17,17,17,19],[33,17,35,17],[15,13,15,15],[15,17,15,19],[16,17,16,19],[16,13,16,15],[14,21,14,23],[17,21,17,23],[33,21,35,21],[14,25,14,27],[17,25,17,27],[33,25,35,25],[15,21,15,23],[15,25,15,27],[16,25,16,27],[16,21,16,23]]}
[]
[]
[null,"GRADE CALCULATOR v3.0"]
[null,"SEMESTER TRACKER"]
[]
[null,"FACULTY","TED ROGERS SCHOOL OF MANAGEMENT"]
[null,null,"FACULTY OF ARTS",null,null,null,"CourseStatus","ENABLED",null,"DATE","Wednesday, January 01, 2014"]
[null,null,"FACULTY OF COMMUNICATION AND DESIGN",null,null,null,null,"DISABLED"]
[null,null,"FACULTY OF COMMUNITY SERVICES"]
[null,null,"FACULTY OF ENGINEERING AND ARCHITECTURAL SCIENCE"]
[null,null,"FACULTY OF SCIENCE"]
[]
[null,"INSERT ALL SEMESTER COURSE INFORMATION BELOW:"]
[]
[null,"(1)",null,null,null,"(2)",null,null,null,"(3)",null,null,null,"(4)",null,null,null,"(5)",null,null,null,"(6)",null,null,null,"(7)"]
[null,"ENABLED",null,null,null,"ENABLED",null,null,null,"DISABLED",null,null,null,"DISABLED",null,null,null,"DISABLED",null,null,null,"DISABLED",null,null,null,"DISABLED"]
[]
[null,"EXG 101",null,null,null,"EXG 102"]
[null,"ITEM","MARK (%)","WEIGHT (%)",null,"ITEM","MARK (%)","WEIGHT (%)",null,"ITEM","MARK (%)","WEIGHT (%)",null,"ITEM","MARK (%)","WEIGHT (%)",null,"ITEM","MARK (%)","WEIGHT (%)",null,"ITEM","MARK (%)","WEIGHT (%)",null,"ITEM","MARK (%)","WEIGHT (%)"]
[null,"Test #1",80,15,null,"Lab 1",80,10]
[null,"Quiz A",100,2.5,null,"Lab 2",68,10]
[null,"Quiz B",95,2.5,null,"Test #1",100,40]
[null,"Test #2",65,30]
[null,"Lab",87.5,10]
[]
[]
[]
[]
[]
[]
[]
[null,null,"TOTAL COMPLETED (%)",{"$f":"SUM(D20:D30)","v":60},null,null,"TOTAL COMPLETED (%)",{"$f":"SUM(H20:H30)","v":60},null,null,"TOTAL COMPLETED (%)",{"$f":"SUM(L20:L30)","v":0},null,null,"TOTAL COMPLETED (%)",{"$f":"SUM(P20:P30)","v":0},null,null,"TOTAL COMPLETED (%)",{"$f":"SUM(T20:T30)","v":0},null,null,"TOTAL COMPLETED (%)",{"$f":"SUM(X20:X30)","v":0},null,null,"TOTAL COMPLETED (%)",{"$f":"SUM(AB20:AB30)","v":0}]
[]
[null,"COURSE SUMMARY:","Average Mark (%):",{"$f":"ROUND((SUMPRODUCT(C20:C30,D20:D30)/SUM(D20:D30)),2)","v":75.209999999999994},null,"COURSE SUMMARY:","Average Mark (%):",{"$f":"ROUND((SUMPRODUCT(G20:G30,H20:H30)/SUM(H20:H30)),2)","v":91.33},null,"COURSE SUMMARY:","Average Mark (%):",{"$f":"ROUND((SUMPRODUCT(K20:K30,L20:L30)/SUM(L20:L30)),2)","v":{"$error":"#DIV/0!"}},null,"COURSE SUMMARY:","Average Mark (%):",{"$f":"ROUND((SUMPRODUCT(O20:O30,P20:P30)/SUM(P20:P30)),2)","v":{"$error":"#DIV/0!"}},null,"COURSE SUMMARY:","Average Mark (%):",{"$f":"ROUND((SUMPRODUCT(S20:S30,T20:T30)/SUM(T20:T30)),2)","v":{"$error":"#DIV/0!"}},null,"COURSE SUMMARY:","Average Mark (%):",{"$f":"ROUND((SUMPRODUCT(W20:W30,X20:X30)/SUM(X20:X30)),2)","v":{"$error":"#DIV/0!"}},null,"COURSE SUMMARY:","Average Mark (%):",{"$f":"ROUND((SUMPRODUCT(AA20:AA30,AB20:AB30)/SUM(AB20:AB30)),2)","v":{"$error":"#DIV/0!"}}]
[null,null,"Grade Points:",{"$f":"IF(ROUND(D34,0)<=49,0,IF(ROUND(D34,0)<=52,0.67,IF(ROUND(D34,0)<=56,1,IF(ROUND(D34,0)<=59,1.33,IF(ROUND(D34,0)<=62,1.67,IF(ROUND(D34,0)<=66,2,IF(ROUND(D34,0)<=69,2.33,IF(ROUND(D34,0)<=72,2.67,IF(ROUND(D34,0)<=76,3,IF(ROUND(D34,0)<=79,3.33,IF(ROUND(D34,0)<=84,3.67,IF(ROUND(D34,0)<=89,4,IF(ROUND(D34,0)<=100,4.33,IF(ROUND(D34,0)>=101,4.33))))))))))))))","v":3},null,null,"Grade Points:",{"$f":"IF(ROUND(H34,0)<=49,0,IF(ROUND(H34,0)<=52,0.67,IF(ROUND(H34,0)<=56,1,IF(ROUND(H34,0)<=59,1.33,IF(ROUND(H34,0)<=62,1.67,IF(ROUND(H34,0)<=66,2,IF(ROUND(H34,0)<=69,2.33,IF(ROUND(H34,0)<=72,2.67,IF(ROUND(H34,0)<=76,3,IF(ROUND(H34,0)<=79,3.33,IF(ROUND(H34,0)<=84,3.67,IF(ROUND(H34,0)<=89,4,IF(ROUND(H34,0)<=100,4.33,IF(ROUND(H34,0)>=101,4.33))))))))))))))","v":4.33},null,null,"Grade Points:",{"$f":"IF(ROUND(L34,0)<=49,0,IF(ROUND(L34,0)<=52,0.67,IF(ROUND(L34,0)<=56,1,IF(ROUND(L34,0)<=59,1.33,IF(ROUND(L34,0)<=62,1.67,IF(ROUND(L34,0)<=66,2,IF(ROUND(L34,0)<=69,2.33,IF(ROUND(L34,0)<=72,2.67,IF(ROUND(L34,0)<=76,3,IF(ROUND(L34,0)<=79,3.33,IF(ROUND(L34,0)<=84,3.67,IF(ROUND(L34,0)<=89,4,IF(ROUND(L34,0)<=100,4.33,IF(ROUND(L34,0)>=101,4.33))))))))))))))","v":{"$error":"#DIV/0!"}},null,null,"Grade Points:",{"$f":"IF(ROUND(P34,0)<=49,0,IF(ROUND(P34,0)<=52,0.67,IF(ROUND(P34,0)<=56,1,IF(ROUND(P34,0)<=59,1.33,IF(ROUND(P34,0)<=62,1.67,IF(ROUND(P34,0)<=66,2,IF(ROUND(P34,0)<=69,2.33,IF(ROUND(P34,0)<=72,2.67,IF(ROUND(P34,0)<=76,3,IF(ROUND(P34,0)<=79,3.33,IF(ROUND(P34,0)<=84,3.67,IF(ROUND(P34,0)<=89,4,IF(ROUND(P34,0)<=100,4.33,IF(ROUND(P34,0)>=101,4.33))))))))))))))","v":{"$error":"#DIV/0!"}},null,null,"Grade Points:",{"$f":"IF(ROUND(T34,0)<=49,0,IF(ROUND(T34,0)<=52,0.67,IF(ROUND(T34,0)<=56,1,IF(ROUND(T34,0)<=59,1.33,IF(ROUND(T34,0)<=62,1.67,IF(ROUND(T34,0)<=66,2,IF(ROUND(T34,0)<=69,2.33,IF(ROUND(T34,0)<=72,2.67,IF(ROUND(T34,0)<=76,3,IF(ROUND(T34,0)<=79,3.33,IF(ROUND(T34,0)<=84,3.67,IF(ROUND(T34,0)<=89,4,IF(ROUND(T34,0)<=100,4.33,IF(ROUND(T34,0)>=101,4.33))))))))))))))","v":{"$error":"#DIV/0!"}},null,null,"Grade Points:",{"$f":"IF(ROUND(X34,0)<=49,0,IF(ROUND(X34,0)<=52,0.67,IF(ROUND(X34,0)<=56,1,IF(ROUND(X34,0)<=59,1.33,IF(ROUND(X34,0)<=62,1.67,IF(ROUND(X34,0)<=66,2,IF(ROUND(X34,0)<=69,2.33,IF(ROUND(X34,0)<=72,2.67,IF(ROUND(X34,0)<=76,3,IF(ROUND(X34,0)<=79,3.33,IF(ROUND(X34,0)<=84,3.67,IF(ROUND(X34,0)<=89,4,IF(ROUND(X34,0)<=100,4.33,IF(ROUND(X34,0)>=101,4.33))))))))))))))","v":{"$error":"#DIV/0!"}},null,null,"Grade Points:",{"$f":"IF(ROUND(AB34,0)<=49,0,IF(ROUND(AB34,0)<=52,0.67,IF(ROUND(AB34,0)<=56,1,IF(ROUND(AB34,0)<=59,1.33,IF(ROUND(AB34,0)<=62,1.67,IF(ROUND(AB34,0)<=66,2,IF(ROUND(AB34,0)<=69,2.33,IF(ROUND(AB34,0)<=72,2.67,IF(ROUND(AB34,0)<=76,3,IF(ROUND(AB34,0)<=79,3.33,IF(ROUND(AB34,0)<=84,3.67,IF(ROUND(AB34,0)<=89,4,IF(ROUND(AB34,0)<=100,4.33,IF(ROUND(AB34,0)>=101,4.33))))))))))))))","v":{"$error":"#DIV/0!"}}]
[null,null,"Letter Grade:",{"$f":"IF(D35 = 0, \"F\", IF(D35 = 0.67, \"D-\", IF(D35 = 1, \"D\", IF(D35 = 1.33, \"D+\", IF(D35 = 1.67, \"C-\", IF(D35 = 2, \"C\", IF(D35 = 2.33, \"C+\", IF(D35 = 2.67, \"B-\", IF(D35 = 3, \"B\", IF(D35 = 3.33, \"B+\", IF(D35 = 3.67, \"A-\", IF(D35 = 4, \"A\", IF(D35 = 4.33, \"A+\")))))))))))))","v":"B"},null,null,"Letter Grade:",{"$f":"IF(H35 = 0, \"F\", IF(H35 = 0.67, \"D-\", IF(H35 = 1, \"D\", IF(H35 = 1.33, \"D+\", IF(H35 = 1.67, \"C-\", IF(H35 = 2, \"C\", IF(H35 = 2.33, \"C+\", IF(H35 = 2.67, \"B-\", IF(H35 = 3, \"B\", IF(H35 = 3.33, \"B+\", IF(H35 = 3.67, \"A-\", IF(H35 = 4, \"A\", IF(H35 = 4.33, \"A+\")))))))))))))","v":"A+"},null,null,"Letter Grade:",{"$f":"IF(L35 = 0, \"F\", IF(L35 = 0.67, \"D-\", IF(L35 = 1, \"D\", IF(L35 = 1.33, \"D+\", IF(L35 = 1.67, \"C-\", IF(L35 = 2, \"C\", IF(L35 = 2.33, \"C+\", IF(L35 = 2.67, \"B-\", IF(L35 = 3, \"B\", IF(L35 = 3.33, \"B+\", IF(L35 = 3.67, \"A-\", IF(L35 = 4, \"A\", IF(L35 = 4.33, \"A+\")))))))))))))","v":{"$error":"#DIV/0!"}},null,null,"Letter Grade:",{"$f":"IF(P35 = 0, \"F\", IF(P35 = 0.67, \"D-\", IF(P35 = 1, \"D\", IF(P35 = 1.33, \"D+\", IF(P35 = 1.67, \"C-\", IF(P35 = 2, \"C\", IF(P35 = 2.33, \"C+\", IF(P35 = 2.67, \"B-\", IF(P35 = 3, \"B\", IF(P35 = 3.33, \"B+\", IF(P35 = 3.67, \"A-\", IF(P35 = 4, \"A\", IF(P35 = 4.33, \"A+\")))))))))))))","v":{"$error":"#DIV/0!"}},null,null,"Letter Grade:",{"$f":"IF(T35 = 0, \"F\", IF(T35 = 0.67, \"D-\", IF(T35 = 1, \"D\", IF(T35 = 1.33, \"D+\", IF(T35 = 1.67, \"C-\", IF(T35 = 2, \"C\", IF(T35 = 2.33, \"C+\", IF(T35 = 2.67, \"B-\", IF(T35 = 3, \"B\", IF(T35 = 3.33, \"B+\", IF(T35 = 3.67, \"A-\", IF(T35 = 4, \"A\", IF(T35 = 4.33, \"A+\")))))))))))))","v":{"$error":"#DIV/0!"}},null,null,"Letter Grade:",{"$f":"IF(X35 = 0, \"F\", IF(X35 = 0.67, \"D-\", IF(X35 = 1, \"D\", IF(X35 = 1.33, \"D+\", IF(X35 = 1.67, \"C-\", IF(X35 = 2, \"C\", IF(X35 = 2.33, \"C+\", IF(X35 = 2.67, \"B-\", IF(X35 = 3, \"B\", IF(X35 = 3.33, \"B+\", IF(X35 = 3.67, \"A-\", IF(X35 = 4, \"A\", IF(X35 = 4.33, \"A+\")))))))))))))","v":{"$error":"#DIV/0!"}},null,null,"Letter Grade:",{"$f":"IF(AB35 = 0, \"F\", IF(AB35 = 0.67, \"D-\", IF(AB35 = 1, \"D\", IF(AB35 = 1.33, \"D+\", IF(AB35 = 1.67, \"C-\", IF(AB35 = 2, \"C\", IF(AB35 = 2.33, \"C+\", IF(AB35 = 2.67, \"B-\", IF(AB35 = 3, \"B\", IF(AB35 = 3.33, \"B+\", IF(AB35 = 3.67, \"A-\", IF(AB35 = 4, \"A\", IF(AB35 = 4.33, \"A+\")))))))))))))","v":{"$error":"#DIV/0!"}}]
[]
[]
[]
[]
{"$rows_left_out":14}
{"sheet":"SINGLE COURSE","index":2,"n_rows":35,"n_cols":4,"rows_kept":35,"cut":false,"hidden":false,"merged":[[32,1,34,1],[16,1,16,3],[14,1,14,3]]}
[]
[]
[null,"GRADE CALCULATOR v3.0"]
[null,"SINGLE COURSE"]
[]
[null,"FACULTY","TED ROGERS SCHOOL OF MANAGEMENT"]
[null,null,"FACULTY OF ARTS"]
[null,null,"FACULTY OF COMMUNICATION AND DESIGN"]
[null,null,"FACULTY OF COMMUNITY SERVICES"]
[null,null,"FACULTY OF ENGINEERING AND ARCHITECTURAL SCIENCE"]
[null,null,"FACULTY OF SCIENCE"]
[]
[null,"INSERT COURSE INFORMATION BELOW:"]
[]
[null,"SINGLE COURSE"]
[]
[null,"SAM 100"]
[null,"ITEM","MARK (%)","WEIGHT (%)"]
[null,"Practice Test",97,0]
[null,"Test #1",77,30]
[]
[]
[]
[]
[]
[]
[]
[]
[]
[]
[null,null,"TOTAL COMPLETED (%)",{"$f":"SUM(D19:D30)","v":30}]
[]
[null,"COURSE SUMMARY:","Average Mark (%):",{"$f":"ROUND((SUMPRODUCT(C19:C30,D19:D30)/SUM(D19:D30)),2)","v":77}]
[null,null,"Grade Points:",{"$f":"IF(ROUND(D33,0)<=49,0,IF(ROUND(D33,0)<=52,0.67,IF(ROUND(D33,0)<=56,1,IF(ROUND(D33,0)<=59,1.33,IF(ROUND(D33,0)<=62,1.67,IF(ROUND(D33,0)<=66,2,IF(ROUND(D33,0)<=69,2.33,IF(ROUND(D33,0)<=72,2.67,IF(ROUND(D33,0)<=76,3,IF(ROUND(D33,0)<=79,3.33,IF(ROUND(D33,0)<=84,3.67,IF(ROUND(D33,0)<=89,4,IF(ROUND(D33,0)<=100,4.33,IF(ROUND(D33,0)>=101,4.33))))))))))))))","v":3.33}]
[null,null,"Letter Grade:",{"$f":"IF(D34 = 0, \"F\", IF(D34 = 0.67, \"D-\", IF(D34 = 1, \"D\", IF(D34 = 1.33, \"D+\", IF(D34 = 1.67, \"C-\", IF(D34 = 2, \"C\", IF(D34 = 2.33, \"C+\", IF(D34 = 2.67, \"B-\", IF(D34 = 3, \"B\", IF(D34 = 3.33, \"B+\", IF(D34 = 3.67, \"A-\", IF(D34 = 4, \"A\", IF(D34 = 4.33, \"A+\")))))))))))))","v":"B+"}]

{"sheet":"CUMULATIVE GPA","index":3,"n_rows":42,"n_cols":16,"rows_kept":42,"cut":false,"hidden":false,"merged":[[14,5,14,7],[14,9,14,11],[14,13,14,15],[37,1,40,2],[37,3,40,3],[14,1,14,3],[37,5,40,6],[37,7,40,7]]}
[]
[]
[null,"GRADE CALCULATOR v3.0"]
[null,"CUMULATIVE GPA"]
[]
[null,"GPAs",4.33,4,3.67,3.33,3,2.67,2.33,2,1.67,1.33,1,0.67,0]
[]
[]
[]
[]
[]
[]
[null,"INSERT CUMULATIVE GPA (CGPA) INFORMATION BELOW:"]
[]
[null,"YEAR 1 COURSES",null,null,null,"YEAR 2 COURSES",null,null,null,"YEAR 3 COURSES",null,null,null,"YEAR 4 COURSES"]
[null,null,"COURSE CODE","GRADE POINTS",null,null,"COURSE CODE","GRADE POINTS",null,null,"COURSE CODE","GRADE POINTS",null,null,"COURSE CODE","GRADE POINTS"]
[null,1,"EXG 101",3.67,"`",1,null,null,null,1,null,null,"`",1]
[null,2,"EXG 102",3.33,null,2,null,null,null,2,null,null,null,2]
[null,3,"EXG 103",4.33,null,3,null,null,null,3,null,null,null,3]
[null,4,"EXG 104",4,null,4,null,null,null,4,null,null,null,4]
[null,5,"EXG 105",3,null,5,null,null,null,5,null,null,null,5]
[null,6,"EXG 106",2.67,null,6,null,null,null,6,null,null,null,6]
[null,7,"EXG 107",4,null,7,null,null,null,7,null,null,null,7]
[null,8,"EXG 108",3,null,8,null,null,null,8,null,null,null,8]
[null,9,"EXG 109",4,null,9,null,null,null,9,null,null,null,9]
[null,10,"EXG 110",3.33,null,10,null,null,null,10,null,null,null,10]
[null,11,null,null,null,11,null,null,null,11,null,null,null,11]
[null,12,null,null,null,12,null,null,null,12,null,null,null,12]
[null,13,null,null,null,13,null,null,null,13,null,null,null,13]
[null,14,null,null,null,14,null,null,null,14,null,null,null,14]
[null,15,null,null,null,15,null,null,null,15,null,null,null,15]
[]
[null,null,"GRADE POINT AVERAGE:",{"$f":"IF(COUNTA(D17:D31)<>0, ROUND(SUM(D17:D31)/COUNTA(D17:D31), 3), \"\")","v":3.5329999999999999},null,null,"GRADE POINT AVERAGE:",{"$f":"IF(COUNTA(H17:H31)<>0,ROUND(SUM(H17:H31)/COUNTA(H17:H31),3),\"\")","v":""},null,null,"GRADE POINT AVERAGE:",{"$f":"IF(COUNTA(L17:L31)<>0, ROUND(SUM(L17:L31)/COUNTA(L17:L31),3), \"\")","v":""},null,null,"GRADE POINT AVERAGE:",{"$f":"IF(COUNTA(P17:P31)<>0, ROUND(SUM(P17:P31)/COUNTA(P17:P31),3), \"\")","v":""}]
[]
[]
[]
[null,null,null,null,null,null,null,null,null,null,{"$f":"IFERROR(IF(OR(AND(H38>=1,H38<=1.66), AND(D38>=1,D38<=1.66)), \"CGPA Within Probationary Range (1.00 - 1.66) Detected\", \"\"), \"\")","v":""}]
[null,"CUMULATIVE GPA",null,{"$f":"ROUND((SUM(D17:D31, H17:H31, L17:L31, P17:P31))/COUNTA(D17:D31, H17:H31, L17:L31, P17:P31),3)","v":3.5329999999999999},null,"CUMULATIVE GPA\n(includes current semester) *",null,{"$f":"ROUND((SUM(D17:D31, H17:H31, L17:L31, P17:P31, IF('SEMESTER TRACKER'!B16=\"ENABLED\", 'SEMESTER TRACKER'!D35, 0), IF('SEMESTER TRACKER'!F16=\"ENABLED\", 'SEMESTER TRACKER'!H35, 0), IF('SEMESTER TRACKER'!J16=\"ENABLED\", 'SEMESTER TRACKER'!L35, 0), IF('SEMESTER TRACKER'!N16=\"ENABLED\", 'SEMESTER TRACKER'!P35, 0), IF('SEMESTER TRACKER'!R16=\"ENABLED\", 'SEMESTER TRACKER'!T35, 0), IF('SEMESTER TRACKER'!V16=\"ENABLED\", 'SEMESTER TRACKER'!X35, 0), IF('SEMESTER TRACKER'!Z16=\"ENABLED\", 'SEMESTER TRACKER'!AB35, 0)))/SUM(COUNTA(D17:D31, H17:H31, L17:L31, P17:P31), COUNTIF('SEMESTER TRACKER'!B16:AB16, \"ENABLED\")),3)","v":3.5550000000000002},null,null,{"$f":"IFERROR(IF(OR(AND(H38>=1,H38<=1.66), AND(D38>=1,D38<=1.66)), \"Please consult with your program office.\", \"\"), \"\")","v":""}]
[null,null,null,null,null,null,null,null,null,null,{"$f":"IFERROR(IF(OR(H38<1, D38<1), \"CGPA Below 1.00 Detected\", \"\"), \"\")","v":""}]
[null,null,null,null,null,null,null,null,null,null,{"$f":"IFERROR(IF(OR(H38<1, D38<1), \"Please check your academic standing on RAMSS and consult your program office.\", \"\"), \"\")","v":""}]
{"$rows_left_out":3}
{"sheet":"METRICS","index":4,"n_rows":61,"n_cols":5,"rows_kept":61,"cut":false,"hidden":false,"merged":[[6,1,12,2],[7,4,7,6],[11,4,11,6],[9,4,9,6]]}
[]
[]
[null,"GRADE CALCULATOR v3.0"]
[null,"METRICS"]
[]
[]
[null,"QUICK \nNAVIGATION\n( click link, then \nscroll if necessary )"]
[null,null,null,null,{"$f":"HYPERLINK(\"[GradeCalcV3.xlsm]METRICS!A19\",\"YEARLY GPA TREND\")","v":"YEARLY GPA TREND"}]
[]
[null,null,null,null,{"$f":"HYPERLINK(\"[GradeCalcV3.xlsm]METRICS!A44\",\"DISTRIBUTION OF GRADE POINTS\")","v":"DISTRIBUTION OF GRADE POINTS"}]
[]
[]
[]
[]
[null,"SEE BELOW FOR VARIOUS CAREER METRICS:"]
[]
[null,"CUMULATIVE STATISTICS"]
[]
[null,"YEARLY GPA TREND"]
[]
[null,"NOTE: This metric uses data from the CUMULATIVE GPA tab."]
[]
[null,"YEAR","Grade Point Average"]
[null,"1",{"$f":"IF('CUMULATIVE GPA'!$D$33<>\"\", 'CUMULATIVE GPA'!$D$33, NA())","v":3.5329999999999999}]
[null,"2",{"$f":"IF('CUMULATIVE GPA'!$H$33<>\"\", 'CUMULATIVE GPA'!$H$33, NA())","v":{"$error":"#N/A"}}]
[null,"3",{"$f":"IF('CUMULATIVE GPA'!$L$33<>\"\", 'CUMULATIVE GPA'!$L$33, NA())","v":{"$error":"#N/A"}}]
[null,"4",{"$f":"IF('CUMULATIVE GPA'!$P$33<>\"\", 'CUMULATIVE GPA'!$P$33, NA())","v":{"$error":"#N/A"}}]
[]
[]
[]
[]
[]
[]
[]
[]
[]
[]
[]
[]
[null,null,"Once Year 2 courses are added (after Year 1 completion), a linear trendline appears. This shows the general direction"]
{"$rows_left_out":22}
{"sheet":"TOOLS","index":5,"n_rows":68,"n_cols":11,"rows_kept":68,"cut":false,"hidden":false,"merged":[[64,2,64,3],[64,4,64,5],[64,7,64,8],[62,7,62,8],[59,2,59,3],[60,2,60,3],[61,2,61,3],[62,2,62,3],[61,4,61,5],[62,4,62,5],[59,4,59,5],[60,4,60,5],[59,7,59,8],[60,7,60,8],[61,7,61,8],[55,2,55,3],[55,7,55,8],[56,2,56,3],[57,2,57,3],[58,2,58,3],[55,4,55,5],[56,7,56,8],[57,7,57,8],[58,7,58,8],[56,4,56,5],[57,4,57,5],[58,4,58,5],[42,1,42,2],[42,3,42,4],[42,5,42,6],[9,4,9,6],[11,4,11,6],[6,1,12,2],[7,4,7,6],[41,1,41,2],[41,3,41,4],[41,5,41,6]]}
[]
[]
[null,"GRADE CALCULATOR v3.0"]
[null,"TOOLS"]
[]
[]
[null,"QUICK \nNAVIGATION\n( click link, then \nscroll if necessary )"]
[null,null,null,null,{"$f":"HYPERLINK(\"[GradeCalcV3.xlsm]TOOLS!A16\",\"SAVE WORKBOOK SNAPSHOT\")","v":"SAVE WORKBOOK SNAPSHOT"}]
[]
[null,null,null,null,{"$f":"HYPERLINK(\"[GradeCalcV3.xlsm]TOOLS!A37\",\"PERCENTAGE FINDER\")","v":"PERCENTAGE FINDER"}]
[]
[null,null,null,null,{"$f":"HYPERLINK(\"[GradeCalcV3.xlsm]TOOLS!A49\",\"GRADE TARGETER\")","v":"GRADE TARGETER"}]
[]
[]
[]
[null,"SAVE WORKBOOK SNAPSHOT"]
[]
[]
[null,"Click the following button to save a copy of this workbook:"]
[]
[]
[]
[null,"The current date is automatically included in the file name, however, you may name the file to anything you choose."]
[null,"Once saved, the file is located in the same directory as the currently opened file \"GradeCalcV3.xlsm\"."]
[]
[]
[null,null,null,null,null,null,null,null,"NOTE: You continue to work and save in the file \"GradeCalcV3.xlsm\" "]
[]
[]
[]
[]
[]
[]
[]
[]
[]
[null,"PERCENTAGE FINDER"]
[]
[]
[null,"Use this tool to convert scores of assignments, quizzes, tests, and other items:"]
{"$rows_left_out":29}
{"sheet":"NOTES","index":6,"n_rows":19,"n_cols":4,"rows_kept":19,"cut":false,"hidden":false,"merged":[[14,3,14,10],[15,3,15,10],[8,3,8,10],[9,3,9,10],[10,3,10,10],[11,3,11,10],[12,3,12,10],[13,3,13,10],[13,1,13,2],[14,1,14,2],[15,1,15,2],[8,1,8,2],[9,1,9,2],[10,1,10,2],[11,1,11,2],[12,1,12,2]]}
[]
[]
[null,"GRADE CALCULATOR v3.0"]
[null,"NOTES"]
[]
[null,"ADD NOTES TO ANY CURRENTLY ENROLLED COURSES:"]
[]
[]
[null,"COURSE NAME*",null,"NOTES"]
[null,{"$f":"IF('SEMESTER TRACKER'!$B$18=\"\", \"\", 'SEMESTER TRACKER'!$B$18)","v":"EXG 101"},null,"Follow-up with Jenny on group project by next class."]
[null,{"$f":"IF('SEMESTER TRACKER'!$F$18=\"\", \"\", 'SEMESTER TRACKER'!$F$18)","v":"EXG 102"}]
[null,{"$f":"IF('SEMESTER TRACKER'!$J$18=\"\", \"\", 'SEMESTER TRACKER'!$J$18)","v":""}]
[null,{"$f":"IF('SEMESTER TRACKER'!$N$18=\"\", \"\", 'SEMESTER TRACKER'!$N$18)","v":""}]
[null,{"$f":"IF('SEMESTER TRACKER'!$R$18=\"\", \"\", 'SEMESTER TRACKER'!$R$18)","v":""}]
[null,{"$f":"IF('SEMESTER TRACKER'!$V$18=\"\", \"\", 'SEMESTER TRACKER'!$V$18)","v":""}]
[null,{"$f":"IF('SEMESTER TRACKER'!$Z$18=\"\", \"\", 'SEMESTER TRACKER'!$Z$18)","v":""}]
[]
[]
[null,"*","Course names are auto-populated from the \"SEMESTER TRACKER\""]