{"text_format":"1","workbook":"xlsx","n_sheets":16,"sheets":["Intro","Summary Sheet","Hazard Level Assessment 1","2","3","4","5","6","7","8","9","10","Review and Export","Hazard Codes & Statements","What to do with results","_"],"not_rendered":{"charts":0,"images":10,"macros":1,"external_links":1,"defined_names":5,"comments":12,"pivot_tables":0},"unopened":[],"bounds":{"document_bytes":16777216,"sheet_cells":100000,"rows_first":2000,"rows_last":500,"rows_between":2000,"halvings":0,"cell_chars":16384,"cell_head_chars":4096},"cells_cut":0,"cells_raw":0,"read":"whole","date_system":"1900"}

{"sheet":"Intro","index":0,"n_rows":50,"n_cols":3,"rows_kept":50,"cut":false,"hidden":false,"merged":[[1,2,1,14],[49,2,68,3],[18,2,18,14]]}
[null,"“Setting Priorities”\nChemical Hazard Assessment and Prioritization (CHAP)"]
[null,"eCHAP-Basic","INSTRUCTIONS FOR USE (PLEASE READ BEFORE STARTING)"]
[null,"Research Partners:"]
[]
[]
[]
[]
[]
{"$rows_left_out":43}
{"sheet":"Summary Sheet","index":1,"n_rows":28,"n_cols":4,"rows_kept":28,"cut":false,"hidden":false,"merged":[[2,1,2,3]]}
[null,"“Setting Priorities”\nChemical Hazard Assessment and Prioritization (CHAP)"]
[]
[null,"\nSummary Sheet\n"]
[null,null,"Company name"]
[null,"Specific worksite","Name"]
[null,null,"Address"]
[null,null,"Phone number"]
[null,null,"Fax number"]
{"$rows_left_out":21}
{"sheet":"Hazard Level Assessment 1","index":2,"n_rows":21,"n_cols":7,"rows_kept":21,"cut":false,"hidden":false,"merged":[[1,1,1,4],[3,2,3,6],[5,3,5,6],[2,1,2,4],[20,3,20,4],[20,5,20,6],[5,1,6,1],[5,2,6,2],[17,1,17,2],[18,1,18,2],[18,3,18,6]]}
[null,"“Setting Priorities”\nChemical Hazard Assessment and Prioritization (CHAP)"]
[null,"Hazard Level Assessment 1\nTop 5 Chemicals - By Quantity Used\nComplete Steps 1, 2, and 3 below"]
[]
[null,"Chemical / Product 1: ",{"$f":"IF('Summary Sheet'!B17=\"\", \"\", 'Summary Sheet'!B17)","v":""}]
[null,"\nStep 1: Physical & Environmental Hazard Statements/Codes\nFind Section 2 of the SDS and determine if the SDS has physical and/or environmental hazard statements/codes. Hover on this cell for additional instructions.\n","No"]
[null,"Step 2: Health Hazard Statements/Codes\nProvide the Health Hazard Statements or Codes from Section 2 of the SDS below. Hover on this cell for additional instructions.",null,"\nHazard Level\n"]
[null,null,null,"Eye Damage","Inhalation","Local Skin Damage","Skin uptake, systemic"]
[1,null,{"$f":"_xlfn.IFNA(VLOOKUP(B8,_!$A$7:$F$210,6,FALSE),\"\")","v":""},{"$f":"_xlfn.IFNA(IF(VLOOKUP(B8,_!$A$7:$E$210,2,FALSE)=0, \"\",VLOOKUP(B8,_!$A$7:$E$210,2,FALSE)), \"\")","v":""},{"$f":"_xlfn.IFNA(IF(VLOOKUP(B8,_!$A$7:$E$210,3,FALSE)=0, \"\",VLOOKUP(B8,_!$A$7:$E$210,3,FALSE)), \"\")","v":""},{"$f":"_xlfn.IFNA(IF(VLOOKUP(B8,_!$A$7:$E$210,4,FALSE)=0, \"\", VLOOKUP(B8,_!$A$7:$E$210,4,FALSE)),\"\")","v":""},{"$f":"_xlfn.IFNA(IF(VLOOKUP(B8,_!$A$7:$E$210,5,FALSE)=0, \"\",VLOOKUP(B8,_!$A$7:$E$210,5,FALSE)), \"\")","v":""}]
{"$rows_left_out":14}
{"sheet":"2","index":3,"n_rows":21,"n_cols":7,"rows_kept":21,"cut":false,"hidden":false,"merged":[[20,3,20,4],[20,5,20,6],[1,1,1,4],[2,1,2,4],[3,2,3,6],[5,1,6,1],[5,2,6,2],[5,3,5,6],[17,1,17,2],[18,1,18,2],[18,3,18,6]]}
[null,"“Setting Priorities”\nChemical Hazard Assessment and Prioritization (CHAP)"]
[null,"Hazard Level Assessment 2\nTop 5 Chemicals - By Quantity Used\nComplete Steps 1, 2, and 3 below"]
[]
[null,"Chemical / Product 2: ",{"$f":"IF('Summary Sheet'!B18=\"\", \"\", 'Summary Sheet'!B18)","v":""}]
[null,"\nStep 1: Physical & Environmental Hazard Statements/Codes\nFind Section 2 of the SDS and determine if the SDS has physical and/or environmental hazard statements/codes. Hover on this cell for additional instructions.\n"]
[null,"Step 2: Health Hazard Statements/Codes\nProvide the Health Hazard Statements or Codes from Section 2 of the SDS below. Hover on this cell for additional instructions.",null,"\nHazard Level\n"]
[null,null,null,"Eye Damage","Inhalation","Local Skin Damage","Skin uptake, systemic"]
[1,null,{"$f":"_xlfn.IFNA(VLOOKUP(B8,_!$A$7:$F$210,6,FALSE),\"\")","v":""},{"$f":"_xlfn.IFNA(IF(VLOOKUP(B8,_!$A$7:$E$210,2,FALSE)=0, \"\",VLOOKUP(B8,_!$A$7:$E$210,2,FALSE)), \"\")","v":""},{"$f":"_xlfn.IFNA(IF(VLOOKUP(B8,_!$A$7:$E$210,3,FALSE)=0, \"\",VLOOKUP(B8,_!$A$7:$E$210,3,FALSE)), \"\")","v":""},{"$f":"_xlfn.IFNA(IF(VLOOKUP(B8,_!$A$7:$E$210,4,FALSE)=0, \"\", VLOOKUP(B8,_!$A$7:$E$210,4,FALSE)),\"\")","v":""},{"$f":"_xlfn.IFNA(IF(VLOOKUP(B8,_!$A$7:$E$210,5,FALSE)=0, \"\",VLOOKUP(B8,_!$A$7:$E$210,5,FALSE)), \"\")","v":""}]
{"$rows_left_out":14}
{"sheet":"3","index":4,"n_rows":21,"n_cols":7,"rows_kept":21,"cut":false,"hidden":false,"merged":[[20,3,20,4],[20,5,20,6],[1,1,1,4],[2,1,2,4],[3,2,3,6],[5,1,6,1],[5,2,6,2],[5,3,5,6],[17,1,17,2],[18,1,18,2],[18,3,18,6]]}
[null,"“Setting Priorities”\nChemical Hazard Assessment and Prioritization (CHAP)"]
[null,"Hazard Level Assessment 3\nTop 5 Chemicals - By Quantity Used\nComplete Steps 1, 2, and 3 below"]
[]
[null,"Chemical / Product 3: ",{"$f":"IF('Summary Sheet'!B19=\"\", \"\", 'Summary Sheet'!B19)","v":""}]
[null,"\nStep 1: Physical & Environmental Hazard Statements/Codes\nFind Section 2 of the SDS and determine if the SDS has physical and/or environmental hazard statements/codes. Hover on this cell for additional instructions.\n"]
[null,"Step 2: Health Hazard Statements/Codes\nProvide the Health Hazard Statements or Codes from Section 2 of the SDS below. Hover on this cell for additional instructions.",null,"\nHazard Level\n"]
[null,null,null,"Eye Damage","Inhalation","Local Skin Damage","Skin uptake, systemic"]
[1,null,{"$f":"_xlfn.IFNA(VLOOKUP(B8,_!$A$7:$F$210,6,FALSE),\"\")","v":""},{"$f":"_xlfn.IFNA(IF(VLOOKUP(B8,_!$A$7:$E$210,2,FALSE)=0, \"\",VLOOKUP(B8,_!$A$7:$E$210,2,FALSE)), \"\")","v":""},{"$f":"_xlfn.IFNA(IF(VLOOKUP(B8,_!$A$7:$E$210,3,FALSE)=0, \"\",VLOOKUP(B8,_!$A$7:$E$210,3,FALSE)), \"\")","v":""},{"$f":"_xlfn.IFNA(IF(VLOOKUP(B8,_!$A$7:$E$210,4,FALSE)=0, \"\", VLOOKUP(B8,_!$A$7:$E$210,4,FALSE)),\"\")","v":""},{"$f":"_xlfn.IFNA(IF(VLOOKUP(B8,_!$A$7:$E$210,5,FALSE)=0, \"\",VLOOKUP(B8,_!$A$7:$E$210,5,FALSE)), \"\")","v":""}]
{"$rows_left_out":14}
{"sheet":"4","index":5,"n_rows":21,"n_cols":7,"rows_kept":21,"cut":false,"hidden":false,"merged":[[20,3,20,4],[20,5,20,6],[1,1,1,4],[2,1,2,4],[3,2,3,6],[5,1,6,1],[5,2,6,2],[5,3,5,6],[17,1,17,2],[18,1,18,2],[18,3,18,6]]}
[null,"“Setting Priorities”\nChemical Hazard Assessment and Prioritization (CHAP)"]
[null,"Hazard Level Assessment 4\nTop 5 Chemicals - By Quantity Used\nComplete Steps 1, 2, and 3 below"]
[]
[null,"Chemical / Product 4: ",{"$f":"IF('Summary Sheet'!B20=\"\", \"\", 'Summary Sheet'!B20)","v":""}]
[null,"\nStep 1: Physical & Environmental Hazard Statements/Codes\nFind Section 2 of the SDS and determine if the SDS has physical and/or environmental hazard statements/codes. Hover on this cell for additional instructions.\n"]
[null,"Step 2: Health Hazard Statements/Codes\nProvide the Health Hazard Statements or Codes from Section 2 of the SDS below. Hover on this cell for additional instructions.",null,"\nHazard Level\n"]
[null,null,null,"Eye Damage","Inhalation","Local Skin Damage","Skin uptake, systemic"]
[1,null,{"$f":"_xlfn.IFNA(VLOOKUP(B8,_!$A$7:$F$210,6,FALSE),\"\")","v":""},{"$f":"_xlfn.IFNA(IF(VLOOKUP(B8,_!$A$7:$E$210,2,FALSE)=0, \"\",VLOOKUP(B8,_!$A$7:$E$210,2,FALSE)), \"\")","v":""},{"$f":"_xlfn.IFNA(IF(VLOOKUP(B8,_!$A$7:$E$210,3,FALSE)=0, \"\",VLOOKUP(B8,_!$A$7:$E$210,3,FALSE)), \"\")","v":""},{"$f":"_xlfn.IFNA(IF(VLOOKUP(B8,_!$A$7:$E$210,4,FALSE)=0, \"\", VLOOKUP(B8,_!$A$7:$E$210,4,FALSE)),\"\")","v":""},{"$f":"_xlfn.IFNA(IF(VLOOKUP(B8,_!$A$7:$E$210,5,FALSE)=0, \"\",VLOOKUP(B8,_!$A$7:$E$210,5,FALSE)), \"\")","v":""}]
{"$rows_left_out":14}
{"sheet":"5","index":6,"n_rows":21,"n_cols":7,"rows_kept":21,"cut":false,"hidden":false,"merged":[[20,3,20,4],[20,5,20,6],[1,1,1,4],[2,1,2,4],[3,2,3,6],[5,1,6,1],[5,2,6,2],[5,3,5,6],[17,1,17,2],[18,1,18,2],[18,3,18,6]]}
[null,"“Setting Priorities”\nChemical Hazard Assessment and Prioritization (CHAP)"]
[null,"Hazard Level Assessment 5\nTop 5 Chemicals - By Quantity Used\nComplete Steps 1, 2, and 3 below"]
[]
[null,"Chemical / Product 5: ",{"$f":"IF('Summary Sheet'!B21=\"\", \"\", 'Summary Sheet'!B21)","v":""}]
[null,"\nStep 1: Physical & Environmental Hazard Statements/Codes\nFind Section 2 of the SDS and determine if the SDS has physical and/or environmental hazard statements/codes. Hover on this cell for additional instructions.\n"]
[null,"Step 2: Health Hazard Statements/Codes\nProvide the Health Hazard Statements or Codes from Section 2 of the SDS below. Hover on this cell for additional instructions.",null,"\nHazard Level\n"]
[null,null,null,"Eye Damage","Inhalation","Local Skin Damage","Skin uptake, systemic"]
[1,null,{"$f":"_xlfn.IFNA(VLOOKUP(B8,_!$A$7:$F$210,6,FALSE),\"\")","v":""},{"$f":"_xlfn.IFNA(IF(VLOOKUP(B8,_!$A$7:$E$210,2,FALSE)=0, \"\",VLOOKUP(B8,_!$A$7:$E$210,2,FALSE)), \"\")","v":""},{"$f":"_xlfn.IFNA(IF(VLOOKUP(B8,_!$A$7:$E$210,3,FALSE)=0, \"\",VLOOKUP(B8,_!$A$7:$E$210,3,FALSE)), \"\")","v":""},{"$f":"_xlfn.IFNA(IF(VLOOKUP(B8,_!$A$7:$E$210,4,FALSE)=0, \"\", VLOOKUP(B8,_!$A$7:$E$210,4,FALSE)),\"\")","v":""},{"$f":"_xlfn.IFNA(IF(VLOOKUP(B8,_!$A$7:$E$210,5,FALSE)=0, \"\",VLOOKUP(B8,_!$A$7:$E$210,5,FALSE)), \"\")","v":""}]
{"$rows_left_out":14}
{"sheet":"6","index":7,"n_rows":21,"n_cols":7,"rows_kept":21,"cut":false,"hidden":false,"merged":[[20,3,20,4],[20,5,20,6],[1,1,1,4],[2,1,2,4],[3,2,3,6],[5,1,6,1],[5,2,6,2],[5,3,5,6],[17,1,17,2],[18,1,18,2],[18,3,18,6]]}
[null,"“Setting Priorities”\nChemical Hazard Assessment and Prioritization (CHAP)"]
[null,"Hazard Level Assessment 6\nTop 5 Chemicals - By Perceived Hazard\nComplete Steps 1, 2, and 3 below"]
[]
[null,"Chemical / Product 6: ",{"$f":"IF('Summary Sheet'!B24=\"\", \"\", 'Summary Sheet'!B24)","v":""}]
[null,"\nStep 1: Physical & Environmental Hazard Statements/Codes\nFind Section 2 of the SDS and determine if the SDS has physical and/or environmental hazard statements/codes. Hover on this cell for additional instructions.\n"]
[null,"Step 2: Health Hazard Statements/Codes\nProvide the Health Hazard Statements or Codes from Section 2 of the SDS below. Hover on this cell for additional instructions.",null,"\nHazard Level\n"]
[null,null,null,"Eye Damage","Inhalation","Local Skin Damage","Skin uptake, systemic"]
[1,null,{"$f":"_xlfn.IFNA(VLOOKUP(B8,_!$A$7:$F$210,6,FALSE),\"\")","v":""},{"$f":"_xlfn.IFNA(IF(VLOOKUP(B8,_!$A$7:$E$210,2,FALSE)=0, \"\",VLOOKUP(B8,_!$A$7:$E$210,2,FALSE)), \"\")","v":""},{"$f":"_xlfn.IFNA(IF(VLOOKUP(B8,_!$A$7:$E$210,3,FALSE)=0, \"\",VLOOKUP(B8,_!$A$7:$E$210,3,FALSE)), \"\")","v":""},{"$f":"_xlfn.IFNA(IF(VLOOKUP(B8,_!$A$7:$E$210,4,FALSE)=0, \"\", VLOOKUP(B8,_!$A$7:$E$210,4,FALSE)),\"\")","v":""},{"$f":"_xlfn.IFNA(IF(VLOOKUP(B8,_!$A$7:$E$210,5,FALSE)=0, \"\",VLOOKUP(B8,_!$A$7:$E$210,5,FALSE)), \"\")","v":""}]
{"$rows_left_out":14}
{"sheet":"7","index":8,"n_rows":21,"n_cols":7,"rows_kept":21,"cut":false,"hidden":false,"merged":[[20,3,20,4],[20,5,20,6],[1,1,1,4],[2,1,2,4],[3,2,3,6],[5,1,6,1],[5,2,6,2],[5,3,5,6],[17,1,17,2],[18,1,18,2],[18,3,18,6]]}
[null,"“Setting Priorities”\nChemical Hazard Assessment and Prioritization (CHAP)"]
[null,"Hazard Level Assessment 7\nTop 5 Chemicals - By Perceived Hazard\nComplete Steps 1, 2, and 3 below"]
[]
[null,"Chemical / Product 7: ",{"$f":"IF('Summary Sheet'!B25=\"\", \"\", 'Summary Sheet'!B25)","v":""}]
[null,"\nStep 1: Physical & Environmental Hazard Statements/Codes\nFind Section 2 of the SDS and determine if the SDS has physical and/or environmental hazard statements/codes. Hover on this cell for additional instructions.\n"]
[null,"Step 2: Health Hazard Statements/Codes\nProvide the Health Hazard Statements or Codes from Section 2 of the SDS below. Hover on this cell for additional instructions.",null,"\nHazard Level\n"]
[null,null,null,"Eye Damage","Inhalation","Local Skin Damage","Skin uptake, systemic"]
[1,null,{"$f":"_xlfn.IFNA(VLOOKUP(B8,_!$A$7:$F$210,6,FALSE),\"\")","v":""},{"$f":"_xlfn.IFNA(IF(VLOOKUP(B8,_!$A$7:$E$210,2,FALSE)=0, \"\",VLOOKUP(B8,_!$A$7:$E$210,2,FALSE)), \"\")","v":""},{"$f":"_xlfn.IFNA(IF(VLOOKUP(B8,_!$A$7:$E$210,3,FALSE)=0, \"\",VLOOKUP(B8,_!$A$7:$E$210,3,FALSE)), \"\")","v":""},{"$f":"_xlfn.IFNA(IF(VLOOKUP(B8,_!$A$7:$E$210,4,FALSE)=0, \"\", VLOOKUP(B8,_!$A$7:$E$210,4,FALSE)),\"\")","v":""},{"$f":"_xlfn.IFNA(IF(VLOOKUP(B8,_!$A$7:$E$210,5,FALSE)=0, \"\",VLOOKUP(B8,_!$A$7:$E$210,5,FALSE)), \"\")","v":""}]
{"$rows_left_out":14}
{"sheet":"8","index":9,"n_rows":21,"n_cols":7,"rows_kept":21,"cut":false,"hidden":false,"merged":[[20,3,20,4],[20,5,20,6],[1,1,1,4],[2,1,2,4],[3,2,3,6],[5,1,6,1],[5,2,6,2],[5,3,5,6],[17,1,17,2],[18,1,18,2],[18,3,18,6]]}
[null,"“Setting Priorities”\nChemical Hazard Assessment and Prioritization (CHAP)"]
[null,"Hazard Level Assessment 8\nTop 5 Chemicals - By Perceived Hazard\nComplete Steps 1, 2, and 3 below"]
[]
[null,"Chemical / Product 8: ",{"$f":"IF('Summary Sheet'!B26=\"\", \"\", 'Summary Sheet'!B26)","v":""}]
[null,"\nStep 1: Physical & Environmental Hazard Statements/Codes\nFind Section 2 of the SDS and determine if the SDS has physical and/or environmental hazard statements/codes. Hover on this cell for additional instructions.\n"]
[null,"Step 2: Health Hazard Statements/Codes\nProvide the Health Hazard Statements or Codes from Section 2 of the SDS below. Hover on this cell for additional instructions.",null,"\nHazard Level\n"]
[null,null,null,"Eye Damage","Inhalation","Local Skin Damage","Skin uptake, systemic"]
[1,null,{"$f":"_xlfn.IFNA(VLOOKUP(B8,_!$A$7:$F$210,6,FALSE),\"\")","v":""},{"$f":"_xlfn.IFNA(IF(VLOOKUP(B8,_!$A$7:$E$210,2,FALSE)=0, \"\",VLOOKUP(B8,_!$A$7:$E$210,2,FALSE)), \"\")","v":""},{"$f":"_xlfn.IFNA(IF(VLOOKUP(B8,_!$A$7:$E$210,3,FALSE)=0, \"\",VLOOKUP(B8,_!$A$7:$E$210,3,FALSE)), \"\")","v":""},{"$f":"_xlfn.IFNA(IF(VLOOKUP(B8,_!$A$7:$E$210,4,FALSE)=0, \"\", VLOOKUP(B8,_!$A$7:$E$210,4,FALSE)),\"\")","v":""},{"$f":"_xlfn.IFNA(IF(VLOOKUP(B8,_!$A$7:$E$210,5,FALSE)=0, \"\",VLOOKUP(B8,_!$A$7:$E$210,5,FALSE)), \"\")","v":""}]
{"$rows_left_out":14}
{"sheet":"9","index":10,"n_rows":21,"n_cols":7,"rows_kept":21,"cut":false,"hidden":false,"merged":[[20,3,20,4],[20,5,20,6],[1,1,1,4],[2,1,2,4],[3,2,3,6],[5,1,6,1],[5,2,6,2],[5,3,5,6],[17,1,17,2],[18,1,18,2],[18,3,18,6]]}
[null,"“Setting Priorities”\nChemical Hazard Assessment and Prioritization (CHAP)"]
[null,"Hazard Level Assessment 9\nTop 5 Chemicals - By Perceived Hazard\nComplete Steps 1, 2, and 3 below"]
[]
[null,"Chemical / Product 9: ",{"$f":"IF('Summary Sheet'!B27=\"\", \"\", 'Summary Sheet'!B27)","v":""}]
[null,"\nStep 1: Physical & Environmental Hazard Statements/Codes\nFind Section 2 of the SDS and determine if the SDS has physical and/or environmental hazard statements/codes. Hover on this cell for additional instructions.\n"]
[null,"Step 2: Health Hazard Statements/Codes\nProvide the Health Hazard Statements or Codes from Section 2 of the SDS below. Hover on this cell for additional instructions.",null,"\nHazard Level\n"]
[null,null,null,"Eye Damage","Inhalation","Local Skin Damage","Skin uptake, systemic"]
[1,null,{"$f":"_xlfn.IFNA(VLOOKUP(B8,_!$A$7:$F$210,6,FALSE),\"\")","v":""},{"$f":"_xlfn.IFNA(IF(VLOOKUP(B8,_!$A$7:$E$210,2,FALSE)=0, \"\",VLOOKUP(B8,_!$A$7:$E$210,2,FALSE)), \"\")","v":""},{"$f":"_xlfn.IFNA(IF(VLOOKUP(B8,_!$A$7:$E$210,3,FALSE)=0, \"\",VLOOKUP(B8,_!$A$7:$E$210,3,FALSE)), \"\")","v":""},{"$f":"_xlfn.IFNA(IF(VLOOKUP(B8,_!$A$7:$E$210,4,FALSE)=0, \"\", VLOOKUP(B8,_!$A$7:$E$210,4,FALSE)),\"\")","v":""},{"$f":"_xlfn.IFNA(IF(VLOOKUP(B8,_!$A$7:$E$210,5,FALSE)=0, \"\",VLOOKUP(B8,_!$A$7:$E$210,5,FALSE)), \"\")","v":""}]
{"$rows_left_out":14}
{"sheet":"10","index":11,"n_rows":21,"n_cols":7,"rows_kept":21,"cut":false,"hidden":false,"merged":[[20,3,20,4],[20,5,20,6],[1,1,1,4],[2,1,2,4],[3,2,3,6],[5,1,6,1],[5,2,6,2],[5,3,5,6],[17,1,17,2],[18,1,18,2],[18,3,18,6]]}
[null,"“Setting Priorities”\nChemical Hazard Assessment and Prioritization (CHAP)"]
[null,"Hazard Level Assessment 10\nTop 5 Chemicals - By Perceived Hazard\nComplete Steps 1, 2, and 3 below"]
[]
[null,"Chemical / Product 10: ",{"$f":"IF('Summary Sheet'!B28=\"\", \"\", 'Summary Sheet'!B28)","v":""}]
[null,"\nStep 1: Physical & Environmental Hazard Statements/Codes\nFind Section 2 of the SDS and determine if the SDS has physical and/or environmental hazard statements/codes. Hover on this cell for additional instructions.\n"]
[null,"Step 2: Health Hazard Statements/Codes\nProvide the Health Hazard Statements or Codes from Section 2 of the SDS below. Hover on this cell for additional instructions.",null,"\nHazard Level\n"]
[null,null,null,"Eye Damage","Inhalation","Local Skin Damage","Skin uptake, systemic"]
[1,null,{"$f":"_xlfn.IFNA(VLOOKUP(B8,_!$A$7:$F$210,6,FALSE),\"\")","v":""},{"$f":"_xlfn.IFNA(IF(VLOOKUP(B8,_!$A$7:$E$210,2,FALSE)=0, \"\",VLOOKUP(B8,_!$A$7:$E$210,2,FALSE)), \"\")","v":""},{"$f":"_xlfn.IFNA(IF(VLOOKUP(B8,_!$A$7:$E$210,3,FALSE)=0, \"\",VLOOKUP(B8,_!$A$7:$E$210,3,FALSE)), \"\")","v":""},{"$f":"_xlfn.IFNA(IF(VLOOKUP(B8,_!$A$7:$E$210,4,FALSE)=0, \"\", VLOOKUP(B8,_!$A$7:$E$210,4,FALSE)),\"\")","v":""},{"$f":"_xlfn.IFNA(IF(VLOOKUP(B8,_!$A$7:$E$210,5,FALSE)=0, \"\",VLOOKUP(B8,_!$A$7:$E$210,5,FALSE)), \"\")","v":""}]
{"$rows_left_out":14}
{"sheet":"Review and Export","index":12,"n_rows":29,"n_cols":4,"rows_kept":29,"cut":false,"hidden":false,"merged":[[2,1,2,3],[3,1,3,3]]}
[null,"“Setting Priorities”\nChemical Hazard Assessment and Prioritization (CHAP)"]
[]
[null,"Summary for Review and Export to Word"]
[null,"Chemical Hazard Assessment and Prioritization - Summary"]
[null,null,"Company name"]
[null,"Specific worksite","Name"]
[null,null,"Address"]
[null,null,"Phone number"]
{"$rows_left_out":22}
{"sheet":"Hazard Codes & Statements","index":13,"n_rows":94,"n_cols":13,"rows_kept":94,"cut":false,"hidden":false,"merged":[[87,2,93,5],[87,9,93,12],[85,0,85,1],[85,2,85,5],[85,7,85,8],[85,9,85,12],[86,2,86,5],[86,9,86,12],[83,0,83,5],[83,7,83,12],[47,0,47,5],[48,0,48,5],[48,7,48,12],[50,0,50,1],[50,2,50,5],[50,7,50,8],[50,9,50,12],[51,2,51,5],[51,9,51,12],[52,2,80,5],[52,9,80,12],[82,0,82,5],[2,0,2,5],[3,0,3,5],[3,7,3,12],[5,0,5,1],[5,2,5,5],[5,7,5,8],[5,9,5,12]]}
["“Setting Priorities”\nChemical Hazard Assessment and Prioritization (CHAP)"]
[]
["Health Hazard Statements"]
["Hazard Statements and Hazard Levels – listed alphabetically by H Statement",null,null,null,null,null,null,"Hazard Statements and Hazard Levels – listed numerically by H Code#"]
[]
["Hazard Statements",null,"Hazard Level [aka Band] (letter code A to E)",null,null,null,null,"Hazard Statements",null,"Hazard Level [aka Band] (letter code A to E)"]
["H Statement","H Code","Eye Damage","Inhalation","Local Skin Damage","Skin uptake, systemic",null,"H Code","H Statement","Eye Damage","Inhalation","Local Skin Damage","Skin uptake, systemic"]
["Causes damage to organs (or specific organ[s], if known)","H370","B","C","n.a.","C",null,"H300","Fatal if swallowed","B","Da (E)c",null,"Db (E)c"]
{"$rows_left_out":87}
{"sheet":"What to do with results","index":14,"n_rows":1,"n_cols":2,"rows_kept":1,"cut":false,"hidden":false,"merged":[[0,1,0,11]]}
["“Setting Priorities”\nChemical Hazard Assessment and Prioritization (CHAP)","What to do with assessment results"]

{"sheet":"_","index":15,"n_rows":210,"n_cols":6,"rows_kept":210,"cut":false,"hidden":true,"merged":[[6,1,6,4]]}
["“Setting Priorities”",null,null,null,null,"Yes"]
["Chemical Hazard Assessment and Prioritization (CHAP)",null,null,null,null,"No"]
[]
[]
["           "]
[]
["Hazard Statements","Hazard Band (letter code A to E)"]
["Hazard Statement","Eye Damage","Inhalation","Local Skin Damage","Skin uptake, systemic","Hazard Code"]
{"$rows_left_out":202}